{"text_format":"1","workbook":"xlsx","n_sheets":11,"sheets":["About","Intro","Definitions","Glazing","Solar prot device","Solar prot device - data","Results-1","Results-2","Results-3","Update","GA"],"not_rendered":{"charts":1,"images":6,"macros":1,"external_links":0,"defined_names":15,"comments":2,"pivot_tables":0},"unopened":[],"bounds":{"document_bytes":16777216,"sheet_cells":100000,"rows_first":2000,"rows_last":500,"rows_between":2000,"halvings":0,"cell_chars":16384,"cell_head_chars":4096},"cells_cut":0,"cells_raw":0,"read":"whole","date_system":"1900"}

{"sheet":"About","index":0,"n_rows":27,"n_cols":5,"rows_kept":27,"cut":false,"hidden":false,"merged":[[23,1,24,7]]}
[]
[]
[null,null,null,null,"European standard EN 13363-1:2007"]
[]
[null,null,null,null,"Solar protection devices combined with glazing -"]
[null,null,null,null,"Calculation of solar and light transmittance -"]
[null,null,null,null,"Part 1: Simplified method"]
[]
[null,null,null,null,"Ontwikkeld door /  Développé par"]
[]
[]
[]
[]
[]
[]
[null,null,null,null,"Wetenschappelijk en Technisch Centrum voor het Bouwbedrijf"]
[null,null,null,null,"Centre Scientifique et Technique de la Construction"]
[null,null,null,null,"Belgian Building Research Institute"]
[]
[]
[null,null,null,null,"in het kader van het Belgische project \"KMO - normenantenne\""]
[null,null,null,null,"dans le cadre du projet belge \"PME - antenne normes\""]
[]
[null,"Read our discaimer on www.wtcb.be or www.cstc.be"]
[]
[]
[null,null,null,null,"Version 7.1"]

{"sheet":"Intro","index":1,"n_rows":39,"n_cols":11,"rows_kept":39,"cut":false,"hidden":false,"merged":[[10,2,10,9],[38,3,39,9],[36,3,37,9],[8,2,8,9],[9,2,9,9],[12,2,12,9],[33,3,33,9],[19,2,19,9],[17,2,17,9],[18,2,18,9],[35,3,35,9],[31,3,31,9],[13,2,13,9],[21,2,21,9],[29,3,29,9]]}
[]
[]
[]
[]
[]
[]
[]
[]
[null,null,"EUROPEAN STANDARD EN 13363-1 : 2007"]
[null,null,"Solar protection devices combined with glazing - Calculation of solar and light transmittance - Part 1 : Simplified method"]
[null,null,"Dispositifs de protection solaire combinés à des vitrages - Calcul du facteur de transmission solaire et lumineuse -  Partie 1 : Méthode simplifiée"]
[]
[null,null,"The European standard EN 13363-1:2003+A1:2007 has been drawn up by the Technical Committee CEN/TC 89 \"Thermal performance of buildings and building components\"."]
[null,null,"This standard consists of two parts :"]
[null,null,"    Part 1 : Simplified method (EN 13363-1)"]
[null,null,"    Part 2 : Detailed calculation method (EN 13363-2)"]
[]
[null,null,"The standard EN 13363-1 gives a simplified method based on the usually known data of the glazing, the U- and g-value, and the solar transmittance and reflectance of the solar protection device to estimate the total solar energy transmittance of a solar protection device combined with a glazing."]
[null,null,"The results of this simplified method are approximate and generally tend to lie on the safe side for cooling load estimations."]
[null,null,"The text of the standard EN 13363-1 must be consulted to know the exact application of this method."]
[]
[null,null,"This Excel sheet allows to carry out the calculations given in this standard in order to be able to estimate the total solar energy transmittance (g-value), the direct solar transmittance, the secondary internal heat transfer factor and the light transmittance of a solar protection device combined with glazing."]
[]
[null,null,"It contains the following sheets:"]
[]
[null,null,null,"· Some definitions are given in the sheet \"Definitions\".",null,null,null,null,null,null,"Definitions"]
[]
[null,null,null,"· Typical data for glazings are indicated in the sheet \"Glazing\".",null,null,null,null,null,null,"Glazing"]
[]
[null,null,null,"· Typical data for solar protection devices are indicated in the sheet \"Solar prot. device\".",null,null,null,null,null,null,"Solar prot device"]
{"$rows_left_out":10}
{"sheet":"Definitions","index":2,"n_rows":61,"n_cols":6,"rows_kept":61,"cut":false,"hidden":false,"merged":[[55,3,55,10],[44,3,44,10],[18,3,18,10],[10,5,10,10],[11,5,11,10],[12,5,12,10],[13,5,13,10],[14,5,14,10],[48,5,48,11]]}
[]
[]
[]
[]
[]
[]
[]
[]
[null,null,null,"Definitions"]
[]
[null,null,null,null,"te ","The direct solar transmittance is the fraction of the incident solar radiation that is directly transmitted by the component (component can be : glazing, solar protection device, combination solar protection device-glazing, …)"]
[null,null,null,null,"re","The direct solar reflectance is the fraction of the incident solar radiation that is directly reflected by the component."]
[null,null,null,null,"g","The total solar energy transmittance (solar factor) is the sum of the direct solar transmittance te and the indirect solar transmittance (fraction of the absorbed radiation that is reemitted to inside).This is the fraction of the total transmitted energy to the total incident solar radiation."]
[null,null,null,null,"U","The thermal transmittance is the density of heat flow rate through a component in the steady state divided by the temperature difference between the surroundings on each side of the component (in W/m² K)"]
[null,null,null,null,"Fc ","The Shading factor is the ratio of the solar factor of the combined glazing and solar protection device gtot to that of the glazing alone g "]
[]
[null,null,null,"Characteristic data"]
[null,null,null,"Glazing"]
[null,null,null,"The glazing is characterised by its thermal transmittance Ug, its total solar energy transmittance g and its transmittance and reflectance values. "]
[]
[null,null,null,null,"Ug ","Thermal transmittance of the glazing [W/m²K]"]
[null,null,null,null,"g","Total solar energy transmittance [-]"]
[null,null,null,null,"te","Direct solar transmittance of the glazing [-]"]
[null,null,null,null,"re","Solar reflectance of the glazing (side facing the incident radiation) [-]"]
[null,null,null,null,"r'e","Solar reflectance of the glazing (opposite side from incident radiation) [-]"]
[null,null,null,null,"tv ","Light transmittance of the glazing [-]"]
[null,null,null,null,"rv ","Light reflectance of the glazing (side facing the incident radiation) [-]"]
[null,null,null,null,"r'v ","Light reflectance of the glazing (opposite side from incident radiation) [-]"]
[null,null,null,null,"qi ","Secondary internal heat transfer factor [-] (qi = g - te)"]
[]
{"$rows_left_out":32}
{"sheet":"Glazing","index":3,"n_rows":18,"n_cols":7,"rows_kept":18,"cut":false,"hidden":false,"merged":[[5,2,8,2],[17,2,17,6]]}
[]
[]
[null,null,"Data for typical glazing"]
[null,null,"(see Annex A in the standard EN 13363-1)"]
[]
[null,null,"Product","Thermal ","Total solar","Light ","Light"]
[null,null,null,"transmittance ","energy","transmittance","reflectance"]
[null,null,null,"W/(m²K)","transmittance"]
[null,null,null,"Ug ","g","tv ","rv = r'v"]
[null,null,"Single clear glass ",5.7,0.85,0.9,0.08]
[null,null,"Double clear glass",3,0.75,0.82,0.15]
[null,null,"Triple clear glass",2,0.65,0.75,0.2]
[null,null,"Double clear glass with low emissivity coating",1.6,0.7,0.75,0.17]
[]
[null,null,"These data are on the safe side for cooling load estimations."]
[]
[null,null,"These data are given for information. "]
[null,null,"The real data (U-value, g-value, light and solar transmittance and reflectance) for the glazing with which you want to combine the solar protection devices have to be introduced in the worsheet \"Results-1\"."]

{"sheet":"Solar prot device","index":4,"n_rows":22,"n_cols":9,"rows_kept":22,"cut":false,"hidden":false,"merged":[[11,3,11,8],[14,3,15,3],[23,3,23,8],[22,3,22,8],[16,3,16,4],[16,5,16,8],[14,5,15,5],[14,6,15,6],[14,7,15,7],[14,8,15,8]]}
[]
[]
[]
[]
[]
[]
[]
[]
[null,null,null,"Typical data for solar protection devices"]
[null,null,null,"(see Annex A of the standard EN 13363-1)"]
[]
[null,null,null,"The next table gives typical values of transmittance and reflectance of solar protection device materials. These are indicative values given for information."]
[]
[]
[null,null,null,null,null,"White","Pastel","Dark","Black"]
[]
[null,null,null,"Transmittance te,B",null,"Reflectance re,B"]
[null,null,null,"Opaque",0,0.7,0.5,0.3,0.1]
[null,null,null,"Medium translucent",0.2,0.6,0.4,0.2,0.1]
[null,null,null,"High translucent",0.4,0.4,0.3,0.2,0.1]
[]
[null,null,null,"The absorptance, ae,B, is equal to 1 - te,B - re,B"]

{"sheet":"Solar prot device - data","index":5,"n_rows":126,"n_cols":12,"rows_kept":126,"cut":false,"hidden":false,"merged":[[18,4,18,10],[11,3,12,8],[16,4,16,10],[17,4,17,10]]}
[]
[]
[]
[]
[]
[]
[]
[]
[]
[null,null,null,"Data for solar protection device"]
[]
[null,null,null,"Please enter the characteristic data of your solar protection devices in the following table :"]
[]
[]
[null,null,null,"Where:"]
[null,null,null,"te,B * ","(Direct) Solar transmittance of the solar protection device [-]",null,null,null,null,null,null,"* Required for the calculation of the g-value"]
[null,null,null,"re,B * ","Solar reflectance of the side of the solar protection device facing the incident radiation [-]",null,null,null,null,null,null,"* Required for the calculation of the g-value"]
[null,null,null,"r'e,B ","Solar reflectance of the side of the solar protection device opposite from the incident radiation [-]"]
[null,null,null,"ae,B","Solar absorptance of the side of the solar protection device facing the incident radiation [-]"]
[null,null,null,"tv,B ","Light transmittance of the solar protection device [-]"]
[null,null,null,"rv,B ","Light reflectance of the side of the solar protection device facing the incident radiation [-]"]
[null,null,null,"r'v,B ","Light reflectance of the side of the solar protection device opposite from the incident radiation [-]"]
[]
[]
[null,null,null,"Prot. ","Name of the solar protection device","te,B","re,B","r'e,B","ae,B","tv,B","rv,B","r'v,B"]
[null,null,null,"nr"]
[null,null,null,1,"Opaque - White",0,0.7,0.7,{"$f":"IF(OR(F27=\"\",G27=\"\"),\"\",1-F27-G27)","v":0.30000000000000004},0,0.7,0.7]
[null,null,null,2,"Opaque - Pastel",0,0.5,0.5,{"$f":"IF(OR(F28=\"\",G28=\"\"),\"\",1-F28-G28)","v":0.5},0,0.5,0.5]
[null,null,null,3,"Opaque - Dark",0,0.3,0.3,0.7,0,0.3,0.3]
[null,null,null,4,"Opaque - Black",0,0.1,0.1,0.9,0,0.1,0.1]
{"$rows_left_out":97}
{"sheet":"Results-1","index":6,"n_rows":133,"n_cols":33,"rows_kept":133,"cut":false,"hidden":false,"merged":[[8,3,8,16],[30,14,30,16],[27,3,28,16],[31,4,32,6],[30,24,30,26],[30,17,30,18],[30,19,30,20],[30,21,30,22]]}
[]
[]
[]
[]
[]
[]
[]
[]
[null,null,null,"Please enter the characteristic data of the glazing with which you want to combine the solar protection device :"]
[]
[null,null,null,"Glazing",null,"Name","Glazing Z"]
[]
[null,null,null,null,null,"U-value * ",1.1000000000000001,"   (thermal transmittance in [W/(m²K)])",null,null,null,null,null,"* Required for the calculation of the g-value"]
[]
[null,null,null,null,null,"g-value * ",0.85,"   (total solar energy transmittance)",null,null,null,null,null,"* Required for the calculation of the g-value"]
[]
[null,null,null,null,null,"t e ",0.27,"   (solar transmittance)"]
[]
[null,null,null,null,null,"r e ",0.28999999999999998,"   (solar reflectance)"]
[]
[null,null,null,null,null,"r' e ",0.38,"   (solar reflectance)"]
[]
[null,null,null,null,null,"t v ",0.27,"   (light transmittance)"]
[]
[null,null,null,null,null,"r v ",0.28999999999999998,"   (light reflectance)"]
[]
[null,null,null,null,null,"r' v ",0.38,"   (light reflectance)"]
[null,null,null,"The following table gives the total solar energy transmittance gtot, the direct solar transmittance te,tot, the secondary internal heat transfer factor qi,tot and the light transmittance tv,tot for the combination of the specified glazing (see characteristics above) and solar protection devices (see characteristics in sheet \"Solar prot. device-data\") according to the standard EN 13363-1. Three cases are distinguished : external solar prot. device, internal solar prot. device and integrated solar prot. device (between glass panes) :"]
[]
[]
{"$rows_left_out":104}
{"sheet":"Results-2","index":7,"n_rows":62,"n_cols":33,"rows_kept":62,"cut":false,"hidden":false,"merged":[[8,2,8,10],[10,8,10,10],[11,7,12,9],[9,2,9,10]]}
[]
[]
[]
[]
[]
[]
[]
[]
[null,null,"The following chart gives the total solar energy transmittance gtotal for the combination glazing - solar protection device. The solar protection device can be external, internal or integrated between the panes. The effect of different U-values and g-values of the glazing on the total solar energy transmittance of the combination is shown."]
[null,null,"Choose the solar protection device that you want to analyse :"]
[]
[null,null,null,null,null,null,null,"(See sheet \"Solar prot device - data\")",null,null,null,null,null,null,null,null,null,null,null,"Glazing","U1",{"$f":"E22","v":1.1000000000000001},"(U = thermal transmittance in [W/(m²K)])"]
[null,null,"9",null,null,null,null,null,null,null,null,null,null,null,null,null,null,null,null,null,"U2",{"$f":"E23","v":3}]
[null,null,null,null,null,null,null,null,null,null,null,null,null,null,null,null,null,null,null,null,"U3",{"$f":"E24","v":5.8}]
[null,null,"Blind","Name:",{"$f":"VLOOKUP($V$15,'Solar prot device - data'!$D$27:$G$126,2)","v":"High translucent - White"},null,null,null,null,null,null,null,null,null,null,null,null,null,null,"Blind","n°",{"$f":"C13*1","v":9},null,null,"G1",5,"W/m²K"]
[null,null,null,"te,B :",{"$f":"IF(VLOOKUP($V$15,'Solar prot device - data'!$D$27:$I$126,3)<>\"\",VLOOKUP($V$15,'Solar prot device - data'!$D$27:$I$126,3),\"\")","v":0.4},null,null,null,null,null,null,null,null,null,null,null,null,null,null,null,"Name",{"$f":"VLOOKUP($V$15,'Solar prot device - data'!$D$27:$G$126,2)","v":"High translucent - White"},null,null,"G2 ext",10,"W/m²K"]
[null,null,null,"re,B :",{"$f":"IF(VLOOKUP($V$15,'Solar prot device - data'!$D$27:$I$126,4)<>\"\",VLOOKUP($V$15,'Solar prot device - data'!$D$27:$I$126,4),\"\")","v":0.4},null,null,null,null,null,null,null,null,null,null,null,null,null,null,null,"te,B",{"$f":"E16","v":0.4},null,null,"G2 int",30,"W/m²K"]
[null,null,null,"ae,B :",{"$f":"IF(VLOOKUP($V$15,'Solar prot device - data'!$D$27:$I$126,6)<>\"\",VLOOKUP($V$15,'Solar prot device - data'!$D$27:$I$126,6),\"\")","v":0.19999999999999996},null,null,null,null,null,null,null,null,null,null,null,null,null,null,null,"re,B",{"$f":"E17","v":0.4},null,null,"G3",3,"W/m²K"]
[null,null,null,null,null,null,null,null,null,null,null,null,null,null,null,null,null,null,null,null,"a e,B",{"$f":"E18","v":0.19999999999999996}]
[null,null,"Choose 3 U-values for the glazing :"]
[]
[null,null,"Glazing","Ug 1 = ",1.1000000000000001,"W/m²K","Show","Internal"]
[null,null,null,"Ug 2 = ",3,"W/m²K",null,"External",null,null,null,null,null,null,null,null,null,null,null,null,null,null,"External,","External,","External,",null,"Internal,","Internal,","Internal,",null,"Between,","Between,","Between,"]
[null,null,null,"Ug 3 = ",5.8,"W/m²K",null,"Between",null,null,null,null,null,null,null,null,null,null,null,null,null,null,{"$f":"CONCATENATE(\"U = \",E22)","v":"U = 1,1"},{"$f":"CONCATENATE(\"U = \",E23)","v":"U = 3"},{"$f":"CONCATENATE(\"U = \",E24)","v":"U = 5,8"},null,{"$f":"CONCATENATE(\"U = \",$E22)","v":"U = 1,1"},{"$f":"CONCATENATE(\"U = \",$E23)","v":"U = 3"},{"$f":"CONCATENATE(\"U = \",$E24)","v":"U = 5,8"},null,{"$f":"CONCATENATE(\"U = \",$E22)","v":"U = 1,1"},{"$f":"CONCATENATE(\"U = \",$E23)","v":"U = 3"},{"$f":"CONCATENATE(\"U = \",$E24)","v":"U = 5,8"}]
[null,null,null,null,null,null,null,null,null,null,null,null,null,null,null,null,null,null,null,null,"U glazing",null,{"$f":"$V$12","v":1.1000000000000001},{"$f":"$V$13","v":3},{"$f":"$V$14","v":5.8},null,{"$f":"$V$12","v":1.1000000000000001},{"$f":"$V$13","v":3},{"$f":"$V$14","v":5.8},null,{"$f":"$V$12","v":1.1000000000000001},{"$f":"$V$13","v":3},{"$f":"$V$14","v":5.8}]
[null,null,null,null,null,null,null,null,null,null,null,null,null,null,null,null,null,null,null,null,"G",null,{"$f":"1/(1/W$25+1/$Z$15+1/$Z$16)","v":0.82706766917293228},{"$f":"1/(1/X$25+1/$Z$15+1/$Z$16)","v":1.5789473684210527},{"$f":"1/(1/Y$25+1/$Z$15+1/$Z$16)","v":2.1167883211678831},null,{"$f":"1/(1/AA$25+1/$Z$17)","v":1.0610932475884245},{"$f":"1/(1/AB$25+1/$Z$17)","v":2.7272727272727275},{"$f":"1/(1/AC$25+1/$Z$17)","v":4.8603351955307259},null,{"$f":"1/(1/$AE25+1/$Z18)","v":0.80487804878048785},{"$f":"1/(1/$AF25+1/$Z18)","v":1.5},{"$f":"1/(1/$AG25+1/$Z18)","v":1.9772727272727271}]
[]
[]
[null,null,null,null,null," ",null,null,null,null,null,null,null,null,null,null,null,null,null,null,"g glazing"]
[]
{"$rows_left_out":33}
{"sheet":"Results-3","index":8,"n_rows":129,"n_cols":64,"rows_kept":129,"cut":false,"hidden":false,"merged":[[24,3,24,14],[8,3,8,17],[26,24,26,27],[26,28,26,31],[25,11,25,22],[25,24,25,31],[27,4,28,6],[26,15,26,18],[26,19,26,22],[26,11,26,14],[25,42,25,53],[26,42,26,45],[26,46,26,49],[26,50,26,53],[25,33,25,40],[26,33,26,36],[26,37,26,40]]}
[]
[]
[]
[]
[]
[]
[]
[]
[null,null,null,"Calculation of the total solar energy transmittance (gtot), the direct solar transmittance te,tot and the secondary internal heat transfer factor qi,tot for the combination of the reference glazings indicated in the standard EN 14501:2005 and the specified solar protection devices (see characteristics in sheet \"Solar prot. device-data\")"]
[]
[null,null,null,"EN 14501 : Blinds and shutters - Thermal and visual comfort - Performance characteristics and classification"]
[]
[null,null,null,"Four reference glazings are specified in the annex A of EN 14501 :"]
[]
[null,null,null," 1. Glazing A : clear single glazing (4 mm)"]
[null,null,null," 2. Glazing B : clear double glazing (4 / 12 / 4), space filled with air "]
[null,null,null," 3. Glazing C : double glazing (4 / 16 / 4), with low emissivity coating in position 3, space filled with argon"]
[null,null,null," 4. Glazing D : Reflective double glazing (4 / 16 / 4), with a low emissivity soft coating in position 2, space filled with Argon"]
[]
[null,null,null,null,null,"U (W/m²K)","g (-)","te","re","r'e"]
[null,null,null,null,"Glazing A",5.8,0.85,0.83,0.08,0.08]
[null,null,null,null,"Glazing B",2.9,0.76,0.69,0.14000000000000001,0.14000000000000001]
[null,null,null,null,"Glazing C",1.2,0.59,0.49,0.28999999999999998,0.27]
[null,null,null,null,"Glazing D",1.1000000000000001,0.32,0.27,0.28999999999999998,0.38]
[null,null,null,null,null,null,null,null,null,null,null,null,null,null,null,null,null,null,null,null,null,null,null,null,null,null,null,null,null,null,null,null,null,null,null,null,null,null,null,null,null,null,null,null,null,null,null,null,null,null,null,null,null,null,null,null,null,null,null,null,"Glazing A","Glazing B","Glazing C","Glazing D"]
[null,null,null,null,null,null,null,null,null,null,null,"SOLAR FACTOR gtot ",null,null,null,null,null,null,null,null,null,null,null,null,"DIRECT SOLAR TRANSMITTANCE te,tot ",null,null,null,null,null,null,null,null,"SECONDARY INTERNAL HEAT TRANSFER FACTOR qi,tot ",null,null,null,null,null,null,null,null,"SHADING FACTOR Fc ",null,null,null,null,null,null,null,null,null,null,null,null,null,null,null,null,"U",{"$f":"F21","v":5.8},{"$f":"F22","v":2.9},{"$f":"F23","v":1.2},{"$f":"F24","v":1.1000000000000001}]
[null,null,null,null,null,null,null,null,null,null,null,"External prot. device",null,null,null,"Internal prot. device",null,null,null,"Integrated prot. device",null,null,null,null,"External prot. device",null,null,null,"Internal prot. device",null,null,null,null,"External prot. device",null,null,null,"Internal prot. device",null,null,null,null,"External prot. device",null,null,null,"Internal prot. device",null,null,null,"Integrated prot. device",null,null,null,null,null,null,null,null,"g",{"$f":"G21","v":0.85},{"$f":"G22","v":0.76},{"$f":"G23","v":0.59},{"$f":"G24","v":0.32}]
[null,null,null,"Comb.","Name of the combination glazing + blind",null,null,"te,B","re,B","r'e,B","ae,B","prot. dev. +","prot. dev. +","prot. dev. +","prot. dev. +","prot. dev. +","prot. dev. +","prot. dev. +","prot. dev. +","prot. dev. +","prot. dev. +","prot. dev. +","prot. dev. +",null,"prot. dev. +","prot. dev. +","prot. dev. +","prot. dev. +","prot. dev. +","prot. dev. +","prot. dev. +","prot. dev. +",null,"prot. dev. +","prot. dev. +","prot. dev. +","prot. dev. +","prot. dev. +","prot. dev. +","prot. dev. +","prot. dev. +",null,"prot. dev. +","prot. dev. +","prot. dev. +","prot. dev. +","prot. dev. +","prot. dev. +","prot. dev. +","prot. dev. +","prot. dev. +","prot. dev. +","prot. dev. +","prot. dev. +",null,null,null,null,null,"G1",5,5,5,5]
[null,null,null,"nr",null,null,null,null,null,null,null,"Glazing A","Glazing B","Glazing C","Glazing D","Glazing A","Glazing B","Glazing C","Glazing D","Glazing A","Glazing B","Glazing C","Glazing D",null,"Glazing A","Glazing B","Glazing C","Glazing D","Glazing A","Glazing B","Glazing C","Glazing D",null,"Glazing A","Glazing B","Glazing C","Glazing D","Glazing A","Glazing B","Glazing C","Glazing D",null,"Glazing A","Glazing B","Glazing C","Glazing D","Glazing A","Glazing B","Glazing C","Glazing D","Glazing A","Glazing B","Glazing C","Glazing D",null,null,null,null,null,"G2 ext",10,10,10,10]
[null,null,null,{"$f":"'Solar prot device - data'!D27","v":1},{"$f":"(\"Glazing\"&\" + \"&'Solar prot device - data'!E27)","v":"Glazing + Opaque - White"},null,null,{"$f":"IF('Solar prot device - data'!F27<>\"\",'Solar prot device - data'!F27,\"\")","v":0},{"$f":"IF('Solar prot device - data'!G27<>\"\",'Solar prot device - data'!G27,\"\")","v":0.7},{"$f":"IF('Solar prot device - data'!H27<>\"\",'Solar prot device - data'!H27,\"\")","v":0.7},{"$f":"IF('Solar prot device - data'!I27<>\"\",'Solar prot device - data'!I27,\"\")","v":0.30000000000000004},{"$f":"IF(AND($H30<>\"\",$I30<>\"\"),$H30*BI$27+$K30*BI$32/BI$29+$H30*(1-BI$27)*BI$32/BI$28,\"\")","v":6.3503649635036491E-2},4.6524064171123009E-2,2.6470588235294117E-2,2.4812030075187973E-2,{"$f":"IF(AND($H30<>\"\",$I30<>\"\"),BI$27*(1-BI$27*$I30-$K30*BI$33/BI$30),\"\")","v":0.30293715083798883},{"$f":"IF(AND($H30<>\"\",$I30<>\"\"),BJ$27*(1-BJ$27*$I30-$K30*BJ$33/BJ$30),\"\")","v":0.33558273556231011},{"$f":"IF(AND($H30<>\"\",$I30<>\"\"),BK$27*(1-BK$27*$I30-$K30*BK$33/BK$30),\"\")","v":0.33952230769230768},{"$f":"IF(AND($H30<>\"\",$I30<>\"\"),BL$27*(1-BL$27*$I30-$K30*BL$33/BL$30),\"\")","v":0.24492450160771703},{"$f":"IF(AND($H30<>\"\",$I30<>\"\"),BI$27*$H30+BI$27*($K30+(1-BI$27)*$I30)*BI$34/BI$31,\"\")","v":0.22689204545454544},{"$f":"IF(AND($H30<>\"\",$I30<>\"\"),BJ$27*$H30+BJ$27*($K30+(1-BJ$27)*$I30)*BJ$34/BJ$31,\"\")","v":0.17482576271186445},{"$f":"IF(AND($H30<>\"\",$I30<>\"\"),BK$27*$H30+BK$27*($K30+(1-BK$27)*$I30)*BK$34/BK$31,\"\")","v":9.8951428571428565E-2},{"$f":"IF(AND($H30<>\"\",$I30<>\"\"),BL$27*$H30+BL$27*($K30+(1-BL$27)*$I30)*BL$34/BL$31,\"\")","v":6.6622439024390259E-2},null,{"$f":"IF(AND($H30<>\"\",$J30<>\"\"),$H$21*$H30/(1-$I$21*$J30),\"\")","v":0},{"$f":"IF(AND($H30<>\"\",$J30<>\"\"),$H$22*$H30/(1-$I$22*$J30),\"\")","v":0},{"$f":"IF(AND($H30<>\"\",$J30<>\"\"),$H$23*$H30/(1-$I$23*$J30),\"\")","v":0},{"$f":"IF(AND($H30<>\"\",$J30<>\"\"),$H$24*$H30/(1-$I$24*$J30),\"\")","v":0},{"$f":"IF(AND($H30<>\"\",$I30<>\"\"),$H$21*$H30/(1-$J$21*$I30),\"\")","v":0},{"$f":"IF(AND($H30<>\"\",$I30<>\"\"),$H$22*$H30/(1-$J$22*$I30),\"\")","v":0},{"$f":"IF(AND($H30<>\"\",$I30<>\"\"),$H$23*$H30/(1-$J$23*$I30),\"\")","v":0},{"$f":"IF(AND($H30<>\"\",$I30<>\"\"),$H$24*$H30/(1-$J$24*$I30),\"\")","v":0},null,{"$f":"IF(AND(L30<>\"\",Y30<>\"\"),L30-Y30,\"\")","v":6.3503649635036491E-2},4.6524064171123009E-2,2.6470588235294117E-2,2.4812030075187973E-2,0.30293715083798883,0.33558273556231011,0.33952230769230768,0.24492450160771703,null,{"$f":"IF(L30<>\"\", L30/$G$21,\"\")","v":7.4710176041219406E-2},{"$f":"IF(M30<>\"\", M30/$G$22,\"\")","v":6.121587390937238E-2},{"$f":"IF(N30<>\"\", N30/$G$23,\"\")","v":4.4865403788634101E-2},{"$f":"IF(O30<>\"\", O30/$G$24,\"\")","v":7.7537593984962419E-2},{"$f":"IF(P30<>\"\", P30/$G$21,\"\")","v":0.35639664804469273},{"$f":"IF(Q30<>\"\", Q30/$G$22,\"\")","v":0.44155623100303959},{"$f":"IF(R30<>\"\", R30/$G$23,\"\")","v":0.57546153846153847},{"$f":"IF(S30<>\"\", S30/$G$24,\"\")","v":0.76538906752411573},{"$f":"IF(T30<>\"\", T30/$G$21,\"\")","v":0.26693181818181816},{"$f":"IF(U30<>\"\", U30/$G$22,\"\")","v":0.23003389830508481},{"$f":"IF(V30<>\"\", V30/$G$23,\"\")","v":0.1677142857142857},{"$f":"IF(W30<>\"\", W30/$G$24,\"\")","v":0.20819512195121956},null,null,null,null,null,"G2 int",30,30,30,30]
{"$rows_left_out":100}
{"sheet":"Update","index":9,"n_rows":6,"n_cols":4,"rows_kept":6,"cut":false,"hidden":false,"merged":[]}
[]
[null,"Version #","Date","Main updates"]
[null,"Version 5","2007-12-12","correction cel E18 of the sheet 'Results-2'"]
[null,"Version 6","2008-05-15","Adaptations of the formulae in order to be conform with the new version of the standard EN13363-1 (2007)"]
[null,"Version 7","2008-07-24","The calculation of the 'shading factor' Fc has been added"]
[null,"Version 7.1","2021-10-22","Sends statistical data to BBRI"]

{"sheet":"GA","index":10,"n_rows":0,"n_cols":0,"rows_kept":0,"cut":false,"hidden":true,"merged":[]}